Add notebook versions of Numpy #55
Annotations
1 error and 3 warnings
deploy-book
The process '/usr/share/miniconda3/condabin/conda' failed with exit code 1
|
deploy-book
Node.js 16 actions are deprecated. Please update the following actions to use Node.js 20: actions/checkout@v2, actions/cache@v1, conda-incubator/setup-miniconda@v2. For more information see: https://github.blog/changelog/2023-09-22-github-actions-transitioning-from-node-16-to-node-20/.
|
deploy-book
The following actions uses node12 which is deprecated and will be forced to run on node16: actions/checkout@v2, actions/cache@v1. For more info: https://github.blog/changelog/2023-06-13-github-actions-all-actions-will-run-on-node16-instead-of-node12-by-default/
|
deploy-book
Pip subprocess error:
error: subprocess-exited-with-error
× Building wheel for lavavu (pyproject.toml) did not run successfully.
│ exit code: 1
╰─> [186 lines of output]
Running setup with args: ['/usr/share/miniconda3/envs/jupyter/lib/python3.7/site-packages/pip/_vendor/pep517/in_process/_in_process.py', 'bdist_wheel', '--dist-dir', '/tmp/pip-wheel-rrflku26/.tmp-vokz6_si']
Version matches: 1.8.62
Using parallel build, jobs: 4
/tmp/tmp_comp__axuq9hfu/test_comp.c:1:10: fatal error: zlib.h: No such file or directory
1 | #include <zlib.h>
| ^~~~~~~~
compilation terminated.
/tmp/tmp_comp__axuq9hfu/test_comp.c:1:10: fatal error: zlib.h: No such file or directory
1 | #include <zlib.h>
| ^~~~~~~~
compilation terminated.
Libraries ['png', 'z'] test build error Command "gcc -pthread -B /usr/share/miniconda3/envs/jupyter/compiler_compat -Wl,--sysroot=/ -Wsign-compare -DNDEBUG -g -fwrapv -O3 -Wall -Wstrict-prototypes -fPIC -I/tmp/pip-build-env-warz4ysa/overlay/lib/python3.7/site-packages/numpy/core/include -Isrc/sqlite3 -c /tmp/tmp_comp__axuq9hfu/test_comp.c -o tmp/tmp_comp__axuq9hfu/test_comp.o" failed with exit status 1
/tmp/tmp_comp__j4cooyzj/test_comp.c:1:10: fatal error: zlib.h: No such file or directory
1 | #include <zlib.h>
| ^~~~~~~~
compilation terminated.
/tmp/tmp_comp__j4cooyzj/test_comp.c:1:10: fatal error: zlib.h: No such file or directory
1 | #include <zlib.h>
| ^~~~~~~~
compilation terminated.
Libraries ['z'] test build error Command "gcc -pthread -B /usr/share/miniconda3/envs/jupyter/compiler_compat -Wl,--sysroot=/ -Wsign-compare -DNDEBUG -g -fwrapv -O3 -Wall -Wstrict-prototypes -fPIC -I/tmp/pip-build-env-warz4ysa/overlay/lib/python3.7/site-packages/numpy/core/include -Isrc/sqlite3 -c /tmp/tmp_comp__j4cooyzj/test_comp.c -o tmp/tmp_comp__j4cooyzj/test_comp.o" failed with exit status 1
/tmp/tmp_comp__g25_chfa/test_comp.c:1:10: fatal error: tiffio.h: No such file or directory
1 | #include <tiffio.h>
| ^~~~~~~~~~
compilation terminated.
/tmp/tmp_comp__g25_chfa/test_comp.c:1:10: fatal error: tiffio.h: No such file or directory
1 | #include <tiffio.h>
| ^~~~~~~~~~
compilation terminated.
Libraries ['tiff'] test build error Command "gcc -pthread -B /usr/share/miniconda3/envs/jupyter/compiler_compat -Wl,--sysroot=/ -Wsign-compare -DNDEBUG -g -fwrapv -O3 -Wall -Wstrict-prototypes -fPIC -I/tmp/pip-build-env-warz4ysa/overlay/lib/python3.7/site-packages/numpy/core/include -Isrc/sqlite3 -c /tmp/tmp_comp__g25_chfa/test_comp.c -o tmp/tmp_comp__g25_chfa/test_comp.o" failed with exit status 1
running bdist_wheel
running build
running build_py
creating build/lib.linux-x86_64-cpython-37
creating build/lib.linux-x86_64-cpython-37/lavavu
copying lavavu/LavaVuPython.py -> build/lib.linux-x86_64-cpython-37/lavavu
copying lavavu/amalgamate.py -> build/lib.linux-x86_64-cpython-37/lavavu
copying lavavu/lavavu.py -> build/lib.linux-x86_64-cpython-37/lavavu
copying lavavu/vutils.py -> build/lib.linux-x86_64-cpython-37/lavavu
copying lavavu/tracers.py -> build/lib.linux-x86_64-cpython-37/lavavu
copying lavavu/__init__.py -> build/lib.linux-x86_64-cpython-37/lavavu
copying lavavu/__main__.py -> build/lib.linux-x86_64-cpython-37/lavavu
copying lavavu/aserver.py -> build/lib.linux-x86_64-cpython-37/lavavu
copying lavavu/points.py -> build/lib.linux-x86_64-cpython-37/lavavu
copying lavavu/control.py -> build/lib.linux-x86_64-cpython-37/lavavu
copying lavavu/server.py -> build/lib.linux-x86_64-cpython-37/lavavu
copying lavavu/convert.py -> build/lib.linux-x86_64-cpython-37/lavavu
copying lavavu/font.bin -> build/lib.linux-x86_64-cpython-37/lavavu
copying lavavu/dict.json -> build/lib.linux-x86_64-cpython-37/lavavu
creating build/li
|